Target
D(3) dopamine receptor
Ligand
BDBM50411716
Substrate
Meas. Tech.
ChEMBL_465003 (CHEMBL948180)
Ki
0.794±n/a nM
Citation
 Micheli, FBonanomi, GBraggio, SCapelli, AMCelestini, PDamiani, FDi Fabio, RDonati, DGagliardi, SGentile, GHamprecht, DPetrone, MRadaelli, STedesco, GTerreni, SWorby, AHeidbreder, C New fused benzazepine as selective D3 receptor antagonists. Synthesis and biological evaluation. Part one: [h]-fused tricyclic systems. Bioorg Med Chem Lett 18:901-7 (2008)  
Target
Name:
D(3) dopamine receptor
Synonyms:
DOPAMINE D3 DRD3_HUMAN Dopamine D3 receptor (D3) Dopamine receptor Dopamine receptor D3
Type:
Mol. Mass.:
44243.43
Organism:
Homo sapiens (Human)
Description:
Residue:
400
  
Inhibitor
Name:
BDBM50411716
Synonyms:
CHEMBL429132
Type:
Small organic molecule
Emp. Form.:
C31H36N6OS
Mol. Mass.:
540.722
SMILES:
Cc1ccc2c(cccc2n1)-c1nnc(SCCCN2CCc3cc4nc(oc4cc3CC2)C(C)(C)C)n1C
: