Target
11-beta-hydroxysteroid dehydrogenase 1
Ligand
BDBM13771
Substrate
Meas. Tech.
ChEMBL_474247 (CHEMBL934096)
IC50
109.65±n/a nM
Citation
 Lee, JHKang, NSYoo, SE Docking-based 3D-QSAR study for 11beta-HSD1 inhibitors. Bioorg Med Chem Lett 18:2479-90 (2008)  
Target
Name:
11-beta-hydroxysteroid dehydrogenase 1
Synonyms:
11-DH 11-beta-Hydroxysteroid Dehydrogenase 1 (11-beta-HSD1) 11-beta-hydroxysteroid dehydrogenase 1 (11HSD1) Corticosteroid 11-beta-dehydrogenase isozyme 1 (11-beta-HSD-1) Corticosteroid 11-beta-dehydrogenase isozyme 1 (11beta-HSD1) HSD11 HSD11L | SDR26C1
Type:
Enzyme
Mol. Mass.:
32409.16
Organism:
Homo sapiens (Human)
Description:
P28845
Residue:
292
  
Inhibitor
Name:
BDBM13771
Synonyms:
2-{[(1R,3R,4S,7S)-4-[2-(4-chlorophenoxy)-2-methylpropanamido]adamantan-1-yl]methoxy}acetic acid | adamantane ether 25
Type:
Small organic molecule
Emp. Form.:
C23H30ClNO5
Mol. Mass.:
435.941
SMILES:
CC(C)(Oc1ccc(Cl)cc1)C(=O)N[C@H]1C2C[C@@H]3C[C@@H]1C[C@](COCC(O)=O)(C3)C2
: