Target
Alpha-2C adrenergic receptor
Ligand
BDBM50412253
Substrate
Meas. Tech.
ChEMBL_487925 (CHEMBL1016579)
Ki
692±n/a nM
Citation
 Gentili, FCardinaletti, CVesprini, CCarrieri, AGhelfi, FFarande, AGiannella, MPiergentili, AQuaglia, WLaurila, JMHuhtinen, AScheinin, MPigini, M Alpha2-adrenoreceptors profile modulation. 4. From antagonist to agonist behavior. J Med Chem 51:4289-99 (2008)  
Target
Name:
Alpha-2C adrenergic receptor
Synonyms:
ADA2C_HUMAN ADRA2L2 Adrenergic alpha2C Adrenergic receptor alpha Alpha-2 adrenergic receptor subtype C4 Alpha-2C adrenoreceptor | adrenergic, alpha-2C-, receptor [Homo sapiens]
Type:
Enzyme
Mol. Mass.:
49552.32
Organism:
Homo sapiens (Human)
Description:
P18825
Residue:
462
  
Inhibitor
Name:
BDBM50412253
Synonyms:
CHEMBL522151
Type:
Small organic molecule
Emp. Form.:
C17H16N2O2
Mol. Mass.:
280.3211
SMILES:
C1CN=C(N1)C1COc2cccc(-c3ccccc3)c2O1
: