Target
Alpha-2B adrenergic receptor
Ligand
BDBM50412249
Substrate
Meas. Tech.
ChEMBL_487921 (CHEMBL1016575)
Ki
708±n/a nM
Citation
 Gentili, FCardinaletti, CVesprini, CCarrieri, AGhelfi, FFarande, AGiannella, MPiergentili, AQuaglia, WLaurila, JMHuhtinen, AScheinin, MPigini, M Alpha2-adrenoreceptors profile modulation. 4. From antagonist to agonist behavior. J Med Chem 51:4289-99 (2008)  
Target
Name:
Alpha-2B adrenergic receptor
Synonyms:
ADA2B_HUMAN ADRA2L1 Adrenergic alpha2B Adrenergic receptor alpha Alpha-2 adrenergic receptor subtype C2 Alpha-2B adrenoreceptor | Alpha-2BAR
Type:
Enzyme
Mol. Mass.:
49964.20
Organism:
Homo sapiens (Human)
Description:
P18089
Residue:
450
  
Inhibitor
Name:
BDBM50412249
Synonyms:
CHEMBL493675
Type:
Small organic molecule
Emp. Form.:
C12H15N3O2
Mol. Mass.:
233.2664
SMILES:
CC(Oc1ccccc1CN=O)C1=NCCN1
: