Target
Alpha-2C adrenergic receptor
Ligand
BDBM50019492
Substrate
Meas. Tech.
ChEMBL_487925 (CHEMBL1016579)
Ki
0.794328±n/a nM
Citation
 Gentili, FCardinaletti, CVesprini, CCarrieri, AGhelfi, FFarande, AGiannella, MPiergentili, AQuaglia, WLaurila, JMHuhtinen, AScheinin, MPigini, M Alpha2-adrenoreceptors profile modulation. 4. From antagonist to agonist behavior. J Med Chem 51:4289-99 (2008)  
Target
Name:
Alpha-2C adrenergic receptor
Synonyms:
ADA2C_HUMAN ADRA2L2 Adrenergic alpha2C Adrenergic receptor alpha Alpha-2 adrenergic receptor subtype C4 Alpha-2C adrenoreceptor | adrenergic, alpha-2C-, receptor [Homo sapiens]
Type:
Enzyme
Mol. Mass.:
49552.32
Organism:
Homo sapiens (Human)
Description:
P18825
Residue:
462
  
Inhibitor
Name:
BDBM50019492
Synonyms:
(+)2-(2-Methoxy-2,3-dihydro-benzo[1,4]dioxin-2-yl)-4,5-dihydro-1H-imidazole 2-(2,3-dihydro-2-methoxy-1,4-benzodioxin-2-yl)-4,5-dihydro-1H-imidazole 2-(2-methoxy-2,3-dihydrobenzo[b][1,4]dioxin-2-yl)-4,5-dihydro-1H-imidazole CHEMBL10332 RX821002
Type:
Small organic molecule
Emp. Form.:
C12H14N2O3
Mol. Mass.:
234.2512
SMILES:
COC1(COc2ccccc2O1)C1=NCCN1
: