Target
Alpha-2A adrenergic receptor
Ligand
BDBM50412259
Substrate
Meas. Tech.
ChEMBL_487917 (CHEMBL1015736)
Ki
257±n/a nM
Citation
 Gentili, FCardinaletti, CVesprini, CCarrieri, AGhelfi, FFarande, AGiannella, MPiergentili, AQuaglia, WLaurila, JMHuhtinen, AScheinin, MPigini, M Alpha2-adrenoreceptors profile modulation. 4. From antagonist to agonist behavior. J Med Chem 51:4289-99 (2008)  
Target
Name:
Alpha-2A adrenergic receptor
Synonyms:
ADA2A_HUMAN ADRA2R Adrenergic alpha2A Alpha-2 adrenergic receptor subtype C10 Alpha-2A adrenoreceptor alpha-2A adrenergic receptor [Homo sapiens]
Type:
Enzyme
Mol. Mass.:
48979.91
Organism:
Homo sapiens (Human)
Description:
P08913
Residue:
465
  
Inhibitor
Name:
BDBM50412259
Synonyms:
CHEMBL492647
Type:
Small organic molecule
Emp. Form.:
C18H18N2O3
Mol. Mass.:
310.3471
SMILES:
COC1(COc2c(O1)cccc2-c1ccccc1)C1=NCCN1
: