Target
Calcium-activated potassium channel subunit alpha-1
Ligand
BDBM50412632
Substrate
Meas. Tech.
ChEMBL_558735 (CHEMBL954137)
IC50
177.83±n/a nM
Citation
 Coi, AFiamingo, FLLivi, OCalderone, VMartelli, AMassarelli, IBianucci, AM QSAR studies on BK channel activators. Bioorg Med Chem 17:319-25 (2008)  
Target
Name:
Calcium-activated potassium channel subunit alpha-1
Synonyms:
Calcium-activated potassium channel alpha/beta 1 KCNMA Large conductance calcium-activated potassium channel subfamily M alpha member 1 isoform b | SLO
Type:
PROTEIN
Mol. Mass.:
137567.62
Organism:
Homo sapiens (Human)
Description:
ChEMBL_938830
Residue:
1236
  
Inhibitor
Name:
BDBM50412632
Synonyms:
CHEMBL511200
Type:
Small organic molecule
Emp. Form.:
C15H12ClN3O
Mol. Mass.:
285.728
SMILES:
Oc1ccc(Cl)cc1-n1cc(Cc2ccccc2)nn1
: