Target
Alpha-1D adrenergic receptor
Ligand
BDBM50412787
Substrate
Meas. Tech.
ChEMBL_539782 (CHEMBL1035000)
Ki
125.89±n/a nM
Citation
 Quaglia, WPiergentili, ADel Bello, FFarande, YGiannella, MPigini, MRafaiani, GCarrieri, AAmantini, CLucciarini, RSantoni, GPoggesi, ELeonardi, A Structure-activity relationships in 1,4-benzodioxan-related compounds. 9. From 1,4-benzodioxane to 1,4-dioxane ring as a promising template of novel alpha1D-adrenoreceptor antagonists, 5-HT1A full agonists, and cytotoxic agents. J Med Chem 51:6359-70 (2008)  
Target
Name:
Alpha-1D adrenergic receptor
Synonyms:
ADA1D_HUMAN ADRA1D Adrenergic receptor alpha Alpha 1D-adrenoreceptor Alpha-1D adrenoceptor adrenergic Alpha1D
Type:
Enzyme Catalytic Domain
Mol. Mass.:
60485.82
Organism:
Homo sapiens (Human)
Description:
adrenergic Alpha1D ADRA1D HUMAN::P25100
Residue:
572
  
Inhibitor
Name:
BDBM50412787
Synonyms:
CHEMBL495289
Type:
Small organic molecule
Emp. Form.:
C25H27NO3
Mol. Mass.:
389.4868
SMILES:
C(COc1ccccc1)NC[C@@H]1COC(CO1)(c1ccccc1)c1ccccc1
: