Target
Lanosterol synthase
Ligand
BDBM50128054
Substrate
Meas. Tech.
ChEMBL_519215 (CHEMBL946654)
IC50
3.47±n/a nM
Citation
 Ermondi, GCaron, G GRIND-based 3D-QSAR to predict inhibitory activity for similar enzymes, OSC and SHC. Eur J Med Chem 43:1462-8 (2008)  
Target
Name:
Lanosterol synthase
Synonyms:
2,3-epoxysqualene--lanosterol cyclase LSS_HUMAN Oxidosqualene--lanosterol cyclase
Type:
PROTEIN
Mol. Mass.:
83309.32
Organism:
Homo sapiens (Human)
Description:
ChEMBL_11231
Residue:
732
  
Inhibitor
Name:
BDBM50128054
Synonyms:
Allyl-{6-[1-(4-bromo-phenyl)-isoquinolin-6-yloxy]-hexyl}-methyl-amine CHEMBL65024 N-allyl-6-(1-(4-bromophenyl)isoquinolin-6-yloxy)-N-methylhexan-1-aminium
Type:
Small organic molecule
Emp. Form.:
C25H29BrN2O
Mol. Mass.:
453.415
SMILES:
CN(CCCCCCOc1ccc2c(nccc2c1)-c1ccc(Br)cc1)CC=C
: