Target
Inhibitor of nuclear factor kappa-B kinase subunit beta
Ligand
BDBM50413877
Substrate
Meas. Tech.
ChEMBL_502283 (CHEMBL983954)
IC50
40±n/a nM
Citation
 Liddle, JBamborough, PBarker, MDCampos, SCousins, RPCutler, GJHobbs, HHolmes, DSIoannou, CMellor, GWMorse, MAPayne, JJPritchard, JMSmith, KJTape, DTWhitworth, CWilliamson, RA 4-Phenyl-7-azaindoles as potent and selective IKK2 inhibitors. Bioorg Med Chem Lett 19:2504-8 (2009)  
Target
Name:
Inhibitor of nuclear factor kappa-B kinase subunit beta
Synonyms:
I-kappa-B Kinase 2 (IKK-beta) I-kappa-B-kinase beta IKBKB IKK-beta IKK2/IKK1 IKKB_HUMAN Inhibitor of nuclear factor kappa B kinase beta subunit Nuclear factor NF-kappa-B inhibitor kinase beta
Type:
Serine/threonine-protein kinase
Mol. Mass.:
86554.39
Organism:
Homo sapiens (Human)
Description:
GST-tagged IKK-2 was expressed in High Five cells and purified.
Residue:
756
  
Inhibitor
Name:
BDBM50413877
Synonyms:
CHEMBL482540
Type:
Small organic molecule
Emp. Form.:
C16H16N4O2S
Mol. Mass.:
328.389
SMILES:
O=S(=O)(NC1CNC1)c1ccc(cc1)-c1ccnc2[nH]ccc12
: