Target
Inhibitor of nuclear factor kappa-B kinase subunit alpha
Ligand
BDBM50413880
Substrate
Meas. Tech.
ChEMBL_502284 (CHEMBL983955)
IC50
50±n/a nM
Citation
 Liddle, JBamborough, PBarker, MDCampos, SCousins, RPCutler, GJHobbs, HHolmes, DSIoannou, CMellor, GWMorse, MAPayne, JJPritchard, JMSmith, KJTape, DTWhitworth, CWilliamson, RA 4-Phenyl-7-azaindoles as potent and selective IKK2 inhibitors. Bioorg Med Chem Lett 19:2504-8 (2009)  
Target
Name:
Inhibitor of nuclear factor kappa-B kinase subunit alpha
Synonyms:
CHUK I-kappa-B kinase 1 IKK-A IKK1 IKKA IkBKA Inhibitor of NF-kappa-B kinase alpha/beta Nuclear factor NF-kappa-B inhibitor kinase alpha TCF16 | Transcription factor 16
Type:
PROTEIN
Mol. Mass.:
84642.21
Organism:
Homo sapiens (Human)
Description:
ChEMBL_327453
Residue:
745
  
Inhibitor
Name:
BDBM50413880
Synonyms:
CHEMBL482746
Type:
Small organic molecule
Emp. Form.:
C18H19N3O4S2
Mol. Mass.:
405.491
SMILES:
O=S(=O)(NC1CCS(=O)(=O)CC1)c1ccc(cc1)-c1ccnc2[nH]ccc12
: