Target
Inhibitor of nuclear factor kappa-B kinase subunit alpha
Ligand
BDBM50395539
Substrate
Meas. Tech.
ChEMBL_502284 (CHEMBL983955)
IC50
13±n/a nM
Citation
 Liddle, JBamborough, PBarker, MDCampos, SCousins, RPCutler, GJHobbs, HHolmes, DSIoannou, CMellor, GWMorse, MAPayne, JJPritchard, JMSmith, KJTape, DTWhitworth, CWilliamson, RA 4-Phenyl-7-azaindoles as potent and selective IKK2 inhibitors. Bioorg Med Chem Lett 19:2504-8 (2009)  
Target
Name:
Inhibitor of nuclear factor kappa-B kinase subunit alpha
Synonyms:
CHUK I-kappa-B kinase 1 IKK-A IKK1 IKKA IkBKA Inhibitor of NF-kappa-B kinase alpha/beta Nuclear factor NF-kappa-B inhibitor kinase alpha TCF16 | Transcription factor 16
Type:
PROTEIN
Mol. Mass.:
84642.21
Organism:
Homo sapiens (Human)
Description:
ChEMBL_327453
Residue:
745
  
Inhibitor
Name:
BDBM50395539
Synonyms:
CHEMBL483165
Type:
Small organic molecule
Emp. Form.:
C19H21N3O4S2
Mol. Mass.:
419.518
SMILES:
Cc1cc2c(ccnc2[nH]1)-c1ccc(cc1)S(=O)(=O)NC1CCS(=O)(=O)CC1
: