Target
Rho-associated protein kinase 1
Ligand
BDBM50413871
Substrate
Meas. Tech.
ChEMBL_502285 (CHEMBL983956)
IC50
20±n/a nM
Citation
 Liddle, JBamborough, PBarker, MDCampos, SCousins, RPCutler, GJHobbs, HHolmes, DSIoannou, CMellor, GWMorse, MAPayne, JJPritchard, JMSmith, KJTape, DTWhitworth, CWilliamson, RA 4-Phenyl-7-azaindoles as potent and selective IKK2 inhibitors. Bioorg Med Chem Lett 19:2504-8 (2009)  
Target
Name:
Rho-associated protein kinase 1
Synonyms:
ROCK-I ROCK1_HUMAN Rho-associated protein kinase Rho-associated, coiled-coil-containing protein kinase 1 Rho-kinase (ROCK I) p160 ROCK-1 | p160ROCK
Type:
Serine/threonine-protein kinase
Mol. Mass.:
158156.77
Organism:
Homo sapiens (Human)
Description:
Q13464
Residue:
1354
  
Inhibitor
Name:
BDBM50413871
Synonyms:
CHEMBL473080 | D3RKN_32
Type:
Small organic molecule
Emp. Form.:
C15H16N4O2S
Mol. Mass.:
316.378
SMILES:
NCCNS(=O)(=O)c1ccc(cc1)-c1ccnc2[nH]ccc12
: