Target
Cannabinoid receptor 1
Ligand
BDBM50414056
Substrate
Meas. Tech.
ChEMBL_570538 (CHEMBL1026910)
Ki
0.65±n/a nM
Citation
 De Freitas, GBda Silva, LLRomeiro, NCFraga, CA Development of CoMFA and CoMSIA models of affinity and selectivity for indole ligands of cannabinoid CB1 and CB2 receptors. Eur J Med Chem 44:2482-96 (2009)  
Target
Name:
Cannabinoid receptor 1
Synonyms:
Brain-type cannabinoid receptor CB-R CNR1_RAT Cannabinoid receptor Cnr1 | Skr6
Type:
G Protein-Coupled Receptor (GPCR)
Mol. Mass.:
52856.55
Organism:
Rattus norvegicus (rat)
Description:
P20272
Residue:
473
  
Inhibitor
Name:
BDBM50414056
Synonyms:
CHEMBL564302 | JWH-182
Type:
Small organic molecule
Emp. Form.:
C27H29NO
Mol. Mass.:
383.5253
SMILES:
CCCCCn1cc(C(=O)c2ccc(CCC)c3ccccc23)c2ccccc12
: