Target
Cannabinoid receptor 2
Ligand
BDBM50265747
Substrate
Meas. Tech.
ChEMBL_570539 (CHEMBL1026911)
Ki
6.1±n/a nM
Citation
 De Freitas, GBda Silva, LLRomeiro, NCFraga, CA Development of CoMFA and CoMSIA models of affinity and selectivity for indole ligands of cannabinoid CB1 and CB2 receptors. Eur J Med Chem 44:2482-96 (2009)  
Target
Name:
Cannabinoid receptor 2
Synonyms:
CANNABINOID CB2 CB2 CB2B CNR2_HUMAN Cannabinoid CB2 receptor Cannabinoid receptor 2 (CB2R) | hCB2
Type:
G Protein-Coupled Receptor (GPCR)
Mol. Mass.:
39690.94
Organism:
Homo sapiens (Human)
Description:
P34972
Residue:
360
  
Inhibitor
Name:
BDBM50265747
Synonyms:
(4-methylnaphthalen-1-yl)(1-propyl-1H-indol-3-yl)methanone JWH-120
Type:
Small organic molecule
Emp. Form.:
C23H21NO
Mol. Mass.:
327.4189
SMILES:
CCCn1cc(C(=O)c2ccc(C)c3ccccc23)c2ccccc12
: