Target
Cannabinoid receptor 2
Ligand
BDBM50414072
Substrate
Meas. Tech.
ChEMBL_570539 (CHEMBL1026911)
Ki
0.729±n/a nM
Citation
 De Freitas, GBda Silva, LLRomeiro, NCFraga, CA Development of CoMFA and CoMSIA models of affinity and selectivity for indole ligands of cannabinoid CB1 and CB2 receptors. Eur J Med Chem 44:2482-96 (2009)  
Target
Name:
Cannabinoid receptor 2
Synonyms:
CANNABINOID CB2 CB2 CB2B CNR2_HUMAN Cannabinoid CB2 receptor Cannabinoid receptor 2 (CB2R) | hCB2
Type:
G Protein-Coupled Receptor (GPCR)
Mol. Mass.:
39690.94
Organism:
Homo sapiens (Human)
Description:
P34972
Residue:
360
  
Inhibitor
Name:
BDBM50414072
Synonyms:
CHEMBL561090 | JWH-149
Type:
Small organic molecule
Emp. Form.:
C26H27NO
Mol. Mass.:
369.4987
SMILES:
CCCCCn1c(C)c(C(=O)c2ccc(C)c3ccccc23)c2ccccc12
: