Target
Adenosine receptor A2a
Ligand
BDBM50414353
Substrate
Meas. Tech.
ChEMBL_575169 (CHEMBL1024516)
Ki
97.72±n/a nM
Citation
 Nieto, MIBalo, MCBrea, JCaamaño, OCadavid, MIFernández, FMera, XGLópez, CRodríguez-Borges, JE Synthesis of novel 1-alkyl-8-substituted-3-(3-methoxypropyl) xanthines as putative A(2B) receptor antagonists. Bioorg Med Chem 17:3426-32 (2009)  
Target
Name:
Adenosine receptor A2a
Synonyms:
A2A adenosine receptor (hA2A) ADENOSINE A2 ADORA2 Adenosine A2A receptor (A2AAR)
Type:
G Protein-Coupled Receptor (GPCR)
Mol. Mass.:
44716.46
Organism:
Homo sapiens (Human)
Description:
P29274
Residue:
412
  
Inhibitor
Name:
BDBM50414353
Synonyms:
CHEMBL563425
Type:
Small organic molecule
Emp. Form.:
C25H26BrN5O5
Mol. Mass.:
556.408
SMILES:
CCn1c(=O)n(CCCOC)c2nc([nH]c2c1=O)-c1ccc(OCC(=O)Nc2ccc(Br)cc2)cc1
: