Target
Adenosine receptor A2b
Ligand
BDBM50414353
Substrate
Meas. Tech.
ChEMBL_575168 (CHEMBL1023664)
Ki
2.88±n/a nM
Citation
 Nieto, MIBalo, MCBrea, JCaamaño, OCadavid, MIFernández, FMera, XGLópez, CRodríguez-Borges, JE Synthesis of novel 1-alkyl-8-substituted-3-(3-methoxypropyl) xanthines as putative A(2B) receptor antagonists. Bioorg Med Chem 17:3426-32 (2009)  
Target
Name:
Adenosine receptor A2b
Synonyms:
AA2BR_HUMAN ADORA2B Adenosine receptors A2b | Adenosine receptors; A2a & A2b
Type:
G Protein-Coupled Receptor (GPCR)
Mol. Mass.:
36341.22
Organism:
Homo sapiens (Human)
Description:
Residue:
332
  
Inhibitor
Name:
BDBM50414353
Synonyms:
CHEMBL563425
Type:
Small organic molecule
Emp. Form.:
C25H26BrN5O5
Mol. Mass.:
556.408
SMILES:
CCn1c(=O)n(CCCOC)c2nc([nH]c2c1=O)-c1ccc(OCC(=O)Nc2ccc(Br)cc2)cc1
: