Target
D(3) dopamine receptor
Ligand
BDBM50331549
Substrate
Meas. Tech.
ChEMBL_577538 (CHEMBL1057890)
Ki
0.794±n/a nM
Citation
 Micheli, FHolmes, IArista, LBonanomi, GBraggio, SCardullo, FDi Fabio, RDonati, DGentile, GHamprecht, DTerreni, SHeidbreder, CSavoia, CGriffante, CWorby, A Dopamine D(3) receptor antagonists: The quest for a potentially selective PET ligand. Part two: Lead optimization. Bioorg Med Chem Lett 19:4011-3 (2009)  
Target
Name:
D(3) dopamine receptor
Synonyms:
DOPAMINE D3 DRD3_HUMAN Dopamine D3 receptor (D3) Dopamine receptor Dopamine receptor D3
Type:
Mol. Mass.:
44243.43
Organism:
Homo sapiens (Human)
Description:
Residue:
400
  
Inhibitor
Name:
BDBM50331549
Synonyms:
CHEMBL567286 | [11C]-3-(2-oxo-3-(2-(4-(trifluoromethyl)piperidin-1-yl)ethyl)imidazolidin-1-yl)benzonitrile
Type:
Small organic molecule
Emp. Form.:
C18H21F3N4O
Mol. Mass.:
366.3807
SMILES:
FC(F)(F)C1CCN(CCN2CCN(C2=O)c2cccc(c2)C#N)CC1
: