Target
Glucocorticoid receptor
Ligand
BDBM50414606
Substrate
Meas. Tech.
ChEMBL_580474 (CHEMBL1052501)
IC50
0.501±n/a nM
Citation
 Biggadike, KCaivano, MClackers, MCoe, DMHardy, GWHumphreys, DJones, HTHouse, DMiles-Williams, ASkone, PAUings, IWeller, VMcLay, IMMacdonald, SJ Highly tractable, sub-nanomolar non-steroidal glucocorticoid receptor agonists. Bioorg Med Chem Lett 19:4846-50 (2009)  
Target
Name:
Glucocorticoid receptor
Synonyms:
GCR_HUMAN GRL Glucocorticoid receptor (GRFP) Nuclear receptor subfamily 3 group C member 1
Type:
Enzyme
Mol. Mass.:
85656.87
Organism:
Homo sapiens (Human)
Description:
P04150
Residue:
777
  
Inhibitor
Name:
BDBM50414606
Synonyms:
CHEMBL550258
Type:
Small organic molecule
Emp. Form.:
C28H28F4N4O2
Mol. Mass.:
528.5411
SMILES:
CCN(CC(O)(CNc1cccc2n(ncc12)-c1ccc(F)cc1)C(F)(F)F)C(=O)c1c(C)cccc1C
: