Target
5-hydroxytryptamine receptor 4
Ligand
BDBM50414733
Substrate
Meas. Tech.
ChEMBL_583010 (CHEMBL1051848)
Ki
6.31±n/a nM
Citation
 McKinnell, RMArmstrong, SRBeattie, DTChoi, SKFatheree, PRGendron, RAGoldblum, AHumphrey, PPLong, DDMarquess, DGShaw, JPSmith, JATurner, SDVickery, RG A multivalent approach to the design and discovery of orally efficacious 5-HT4 receptor agonists. J Med Chem 52:5330-43 (2009)  
Target
Name:
5-hydroxytryptamine receptor 4
Synonyms:
5-HT-4 5-HT4S 5-HT4b 5-HT4d 5-hydroxytryptamine receptor 4 5HT4R_HUMAN Serotonin (5-HT) receptor Serotonin 4 (5-HT4) receptor | Serotonin Receptor 4
Type:
Enzyme
Mol. Mass.:
43767.54
Organism:
Homo sapiens (Human)
Description:
Q13639
Residue:
388
  
Inhibitor
Name:
BDBM50414733
Synonyms:
CHEMBL561398
Type:
Small organic molecule
Emp. Form.:
C28H40N4O2
Mol. Mass.:
464.6428
SMILES:
[H][C@]12CC[C@]([H])(C[C@H](C1)NC(=O)c1cc3ccccc3n(C(C)C)c1=O)N2CCCN1CCCCC1
: