Target
Cholecystokinin receptor type A
Ligand
BDBM50415052
Substrate
Meas. Tech.
ChEMBL_595444 (CHEMBL1045209)
Ki
31.62±n/a nM
Citation
 Pippel, MAllison, BDPhuong, VKLi, LMorton, MFPrendergast, CWu, XShankley, NPRabinowitz, MH Anthranilic sulfonamide CCK1/CCK2 dual receptor antagonists I: discovery of CCKR1 selectivity in a previously CCKR2-selective lead series. Bioorg Med Chem Lett 19:6373-5 (2009)  
Target
Name:
Cholecystokinin receptor type A
Synonyms:
CCK-A receptor CCK1-R CCKAR_HUMAN Cholecystokinin receptor Cholecystokinin-1 Receptor
Type:
G Protein-Coupled Receptor (GPCR)
Mol. Mass.:
47859.34
Organism:
Homo sapiens (Human)
Description:
Stable expression of human CCK-1 receptors in HEK 293 cells.
Residue:
428
  
Inhibitor
Name:
BDBM50415052
Synonyms:
CHEMBL583343
Type:
Small organic molecule
Emp. Form.:
C27H19Cl3N4O3S2
Mol. Mass.:
617.954
SMILES:
Clc1ccc(cc1)C(CNC(=O)c1ccc(Cl)cc1NS(=O)(=O)c1cccc2nsnc12)c1ccc(Cl)cc1
: