Target
Gastrin/cholecystokinin type B receptor
Ligand
BDBM50415068
Substrate
Meas. Tech.
ChEMBL_595445 (CHEMBL1045210)
Ki
39.81±n/a nM
Citation
 Pippel, MAllison, BDPhuong, VKLi, LMorton, MFPrendergast, CWu, XShankley, NPRabinowitz, MH Anthranilic sulfonamide CCK1/CCK2 dual receptor antagonists I: discovery of CCKR1 selectivity in a previously CCKR2-selective lead series. Bioorg Med Chem Lett 19:6373-5 (2009)  
Target
Name:
Gastrin/cholecystokinin type B receptor
Synonyms:
CCK-2 receptor CCK-BR CCKRB Cholecystokinin receptor GASR_HUMAN | Gastrin/cholecystokinin type B receptor
Type:
G Protein-Coupled Receptor (GPCR)
Mol. Mass.:
48445.79
Organism:
Homo sapiens (Human)
Description:
Stable expression of human CCK-2 receptors in HEK 293 cells.
Residue:
447
  
Inhibitor
Name:
BDBM50415068
Synonyms:
CHEMBL569470
Type:
Small organic molecule
Emp. Form.:
C22H15BrCl2N4O5S2
Mol. Mass.:
630.318
SMILES:
OC(=O)[C@H](Cc1ccc(Cl)c(Br)c1)NC(=O)c1ccc(Cl)cc1NS(=O)(=O)c1cccc2nsnc12
: