Target
Gastrin/cholecystokinin type B receptor
Ligand
BDBM50415085
Substrate
Meas. Tech.
ChEMBL_595454 (CHEMBL1045219)
Ki
12.59±n/a nM
Citation
 Pippel, MBoyce, KVenkatesan, HPhuong, VKYan, WBarrett, TDLagaud, GLi, LMorton, MFPrendergast, CWu, XShankley, NPRabinowitz, MH Anthranilic sulfonamide CCK1/CCK2 dual receptor antagonists II: tuning of receptor selectivity and in vivo efficacy. Bioorg Med Chem Lett 19:6376-8 (2009)  
Target
Name:
Gastrin/cholecystokinin type B receptor
Synonyms:
CCK-2 receptor CCK-BR CCKRB Cholecystokinin receptor GASR_HUMAN | Gastrin/cholecystokinin type B receptor
Type:
G Protein-Coupled Receptor (GPCR)
Mol. Mass.:
48445.79
Organism:
Homo sapiens (Human)
Description:
Stable expression of human CCK-2 receptors in HEK 293 cells.
Residue:
447
  
Inhibitor
Name:
BDBM50415085
Synonyms:
CHEMBL570520
Type:
Small organic molecule
Emp. Form.:
C22H15Br2ClN4O5S2
Mol. Mass.:
674.769
SMILES:
OC(=O)[C@H](Cc1ccc(Cl)c(Br)c1)NC(=O)c1ccc(Br)cc1NS(=O)(=O)c1cccc2nsnc12
: