Target
Alpha-2B adrenergic receptor
Ligand
BDBM50415137
Substrate
Meas. Tech.
ChEMBL_595093 (CHEMBL1047079)
Ki
269±n/a nM
Citation
 Cardinaletti, CMattioli, LGhelfi, FDel Bello, FGiannella, MBruzzone, AParis, HPerfumi, MPiergentili, AQuaglia, WPigini, M Might adrenergic alpha2C-agonists/alpha2A-antagonists become novel therapeutic tools for pain treatment with morphine? J Med Chem 52:7319-22 (2009)  
Target
Name:
Alpha-2B adrenergic receptor
Synonyms:
ADA2B_HUMAN ADRA2L1 Adrenergic alpha2B Adrenergic receptor alpha Alpha-2 adrenergic receptor subtype C2 Alpha-2B adrenoreceptor | Alpha-2BAR
Type:
Enzyme
Mol. Mass.:
49964.20
Organism:
Homo sapiens (Human)
Description:
P18089
Residue:
450
  
Inhibitor
Name:
BDBM50415137
Synonyms:
CHEMBL570863
Type:
Small organic molecule
Emp. Form.:
C12H16N2O
Mol. Mass.:
204.2682
SMILES:
CC(OC1=NCCN1)c1ccccc1C
: