Target
Muscarinic acetylcholine receptor M1
Ligand
BDBM50416240
Substrate
Meas. Tech.
ChEMBL_635559 (CHEMBL1118276)
EC50
12.59±n/a nM
Citation
 Budzik, BGarzya, VShi, DFoley, JJRivero, RALangmead, CJWatson, JWu, ZForbes, ITJin, J 2' biaryl amides as novel and subtype selective M1 agonists. Part I: Identification, synthesis, and initial SAR. Bioorg Med Chem Lett 20:3540-4 (2010)  
Target
Name:
Muscarinic acetylcholine receptor M1
Synonyms:
ACM1_HUMAN Cholinergic receptor, muscarinic 1 | Cholinergic, muscarinic M1
Type:
Protein
Mol. Mass.:
51442.54
Organism:
Homo sapiens (Human)
Description:
P11229
Residue:
460
  
Inhibitor
Name:
BDBM50416240
Synonyms:
CHEMBL1083723
Type:
Small organic molecule
Emp. Form.:
C20H23ClN2O
Mol. Mass.:
342.862
SMILES:
Cc1ccc(cc1Cl)-c1ccccc1C(=O)NCC1CCNCC1
: