Target
D(3) dopamine receptor
Ligand
BDBM50312271
Substrate
Meas. Tech.
ChEMBL_652494 (CHEMBL1225697)
Ki
0.501±n/a nM
Citation
 Micheli, FHamprecht, DBonanomi, GDi Fabio, RDonati, DGentile, GHeidbreder, CPrandi, ATarsi, LTerreni, S [3-azabicyclo[3.1.0]hex-1-yl]phenyl-benzenesulfonamides as selective dopamine D3 antagonists. Bioorg Med Chem Lett 20:5491-4 (2010)  
Target
Name:
D(3) dopamine receptor
Synonyms:
DOPAMINE D3 DRD3_HUMAN Dopamine D3 receptor (D3) Dopamine receptor Dopamine receptor D3
Type:
Mol. Mass.:
44243.43
Organism:
Homo sapiens (Human)
Description:
Residue:
400
  
Inhibitor
Name:
BDBM50312271
Synonyms:
(1S,5R)-3-(3-{[4-Methyl-5-(4-methyl-1,3-oxazol-5-yl)-4H-1,2,4-triazol-3-yl]thio}propyl)-1-[4-(trifluoromethyl)phenyl]-3-azabicyclo[3.1.0]hexane | CHEMBL1081409
Type:
Small organic molecule
Emp. Form.:
C22H24F3N5OS
Mol. Mass.:
463.519
SMILES:
Cc1ncoc1-c1nnc(SCCCN2C[C@@H]3C[C@@]3(C2)c2ccc(cc2)C(F)(F)F)n1C
: