Target
Vascular endothelial growth factor receptor 2
Ligand
BDBM8829
Substrate
Meas. Tech.
ChEMBL_654559 (CHEMBL1243603)
IC50
257.04±n/a nM
Citation
 Cao, HZhang, HZheng, XGao, D 3D QSAR studies on a series of potent and high selective inhibitors for three kinases of RTK family. J Mol Graph Model 26:236-45 (2007)  
Target
Name:
Vascular endothelial growth factor receptor 2
Synonyms:
CD_antigen=CD309 Fetal liver kinase 1 (FLK-1) KDR Protein-tyrosine kinase receptor Flk-1 VEGFR-2 VEGFR2 Vascular Endothelial Growth Factor Receptor Kinase 2 Vascular endothelial growth factor receptor 2 (KDR) Vascular endothelial growth factor receptor 2 (VEGFR2) Vascular endothelial growth factor receptor-2 (VEGFR-2)
Type:
Receptor Tyrosine Kinase
Mol. Mass.:
151510.97
Organism:
Homo sapiens (Human)
Description:
P35968
Residue:
1356
  
Inhibitor
Name:
BDBM8829
Synonyms:
3-(4-{4-amino-6-methylthieno[2,3-d]pyrimidin-5-yl}phenyl)-1-(2-methylphenyl)urea Thienopyrimidine deriv. 10
Type:
Small organic molecule
Emp. Form.:
C21H19N5OS
Mol. Mass.:
389.473
SMILES:
Cc1sc2ncnc(N)c2c1-c1ccc(NC(=O)Nc2ccccc2C)cc1
: