Target
Vascular endothelial growth factor receptor 2
Ligand
BDBM50375998
Substrate
Meas. Tech.
ChEMBL_655558 (CHEMBL1244602)
IC50
28.18±n/a nM
Citation
 Du, JLei, BQin, JLiu, HYao, X Molecular modeling studies of vascular endothelial growth factor receptor tyrosine kinase inhibitors using QSAR and docking. J Mol Graph Model 27:642-54 (2008)  
Target
Name:
Vascular endothelial growth factor receptor 2
Synonyms:
CD_antigen=CD309 Fetal liver kinase 1 (FLK-1) KDR Protein-tyrosine kinase receptor Flk-1 VEGFR-2 VEGFR2 Vascular Endothelial Growth Factor Receptor Kinase 2 Vascular endothelial growth factor receptor 2 (KDR) Vascular endothelial growth factor receptor 2 (VEGFR2) Vascular endothelial growth factor receptor-2 (VEGFR-2)
Type:
Receptor Tyrosine Kinase
Mol. Mass.:
151510.97
Organism:
Homo sapiens (Human)
Description:
P35968
Residue:
1356
  
Inhibitor
Name:
BDBM50375998
Synonyms:
CHEMBL272251
Type:
Small organic molecule
Emp. Form.:
C24H22N2O4
Mol. Mass.:
402.4425
SMILES:
COCCNC(=O)c1cccc2cc(Oc3ccnc4cc(OC)ccc34)ccc12
: