Target
Metabotropic glutamate receptor 5
Ligand
BDBM50417001
Substrate
Meas. Tech.
ChEMBL_664468 (CHEMBL1259850)
EC50
3311.31±n/a nM
Citation
 Lowe, EWFerrebee, ARodriguez, ALConn, PJMeiler, J 3D-QSAR CoMFA study of benzoxazepine derivatives as mGluR5 positive allosteric modulators. Bioorg Med Chem Lett 20:5922-4 (2010)  
Target
Name:
Metabotropic glutamate receptor 5
Synonyms:
GRM5_RAT Grm5 Mglur5 metabotropic glutamate 5/1-C metabotropic glutamate 5a
Type:
Enzyme
Mol. Mass.:
131900.14
Organism:
Rattus norvegicus (Rat)
Description:
P31424
Residue:
1203
  
Inhibitor
Name:
BDBM50417001
Synonyms:
CHEMBL1258060
Type:
Small organic molecule
Emp. Form.:
C24H21BrN4O5S
Mol. Mass.:
557.416
SMILES:
COc1cc(cc(Br)c1OC(C)=O)[C@@H]1Oc2nc(SCC=C)nnc2-c2ccccc2N1C(C)=O
: