Target
Alpha-1A adrenergic receptor
Ligand
BDBM50417391
Substrate
Meas. Tech.
ChEMBL_686320 (CHEMBL1293076)
Ki
100±n/a nM
Citation
 Pizzi, DALeslie, CPMazzali, ASeri, CBiagetti, MBentley, JGenski, TDi Fabio, RContini, SSabbatini, FMZonzini, LCaberlotto, L Design, synthesis and SAR of a novel series of benzimidazoles as potent NPY Y5 antagonists. Bioorg Med Chem Lett 20:7120-3 (2010)  
Target
Name:
Alpha-1A adrenergic receptor
Synonyms:
ADA1A_HUMAN ADRA1C Alpha 1A-adrenoceptor Alpha adrenergic receptor 1a Alpha-adrenergic receptor 1c adrenergic Alpha1 | adrenergic Alpha1C
Type:
Cell-surface receptors
Mol. Mass.:
51511.67
Organism:
Homo sapiens (Human)
Description:
P35348
Residue:
466
  
Inhibitor
Name:
BDBM50417391
Synonyms:
CHEMBL1290706
Type:
Small organic molecule
Emp. Form.:
C21H19F3N4O2
Mol. Mass.:
416.3964
SMILES:
FC(F)(F)c1ccc2nc([nH]c2c1)N1CCC2(CN(C(=O)O2)c2ccccc2)CC1
: