Target
Neuropeptide Y receptor type 5
Ligand
BDBM50417393
Substrate
Meas. Tech.
ChEMBL_686319 (CHEMBL1293075)
Ki
79.43±n/a nM
Citation
 Pizzi, DALeslie, CPMazzali, ASeri, CBiagetti, MBentley, JGenski, TDi Fabio, RContini, SSabbatini, FMZonzini, LCaberlotto, L Design, synthesis and SAR of a novel series of benzimidazoles as potent NPY Y5 antagonists. Bioorg Med Chem Lett 20:7120-3 (2010)  
Target
Name:
Neuropeptide Y receptor type 5
Synonyms:
NPY-Y5 NPY5-R NPY5R_HUMAN NPYY5 Neuropeptide Y receptor type 5 ( NPY Y5) | Y5 receptor
Type:
Enzyme
Mol. Mass.:
50746.64
Organism:
Homo sapiens (Human)
Description:
Q15761
Residue:
445
  
Inhibitor
Name:
BDBM50417393
Synonyms:
CHEMBL1289610
Type:
Small organic molecule
Emp. Form.:
C22H21F3N4O3
Mol. Mass.:
446.4223
SMILES:
Cc1ncccc1N1C[C@@]2(CC[C@@H](CC2)c2nc3ccc(OC(F)(F)F)cc3[nH]2)OC1=O
: