Target
Neuropeptide Y receptor type 5
Ligand
BDBM50417403
Substrate
Meas. Tech.
ChEMBL_686319 (CHEMBL1293075)
Ki
0.631±n/a nM
Citation
 Pizzi, DALeslie, CPMazzali, ASeri, CBiagetti, MBentley, JGenski, TDi Fabio, RContini, SSabbatini, FMZonzini, LCaberlotto, L Design, synthesis and SAR of a novel series of benzimidazoles as potent NPY Y5 antagonists. Bioorg Med Chem Lett 20:7120-3 (2010)  
Target
Name:
Neuropeptide Y receptor type 5
Synonyms:
NPY-Y5 NPY5-R NPY5R_HUMAN NPYY5 Neuropeptide Y receptor type 5 ( NPY Y5) | Y5 receptor
Type:
Enzyme
Mol. Mass.:
50746.64
Organism:
Homo sapiens (Human)
Description:
Q15761
Residue:
445
  
Inhibitor
Name:
BDBM50417403
Synonyms:
CHEMBL1290038
Type:
Small organic molecule
Emp. Form.:
C22H19FN4O2
Mol. Mass.:
390.4103
SMILES:
Fc1ccc(cc1)N1C[C@@]2(CC[C@@H](CC2)c2nc3ccc(cc3[nH]2)C#N)OC1=O
: