Target
Neuropeptide Y receptor type 5
Ligand
BDBM50304300
Substrate
Meas. Tech.
ChEMBL_686319 (CHEMBL1293075)
IC50
1.26±n/a nM
Citation
 Pizzi, DALeslie, CPMazzali, ASeri, CBiagetti, MBentley, JGenski, TDi Fabio, RContini, SSabbatini, FMZonzini, LCaberlotto, L Design, synthesis and SAR of a novel series of benzimidazoles as potent NPY Y5 antagonists. Bioorg Med Chem Lett 20:7120-3 (2010)  
Target
Name:
Neuropeptide Y receptor type 5
Synonyms:
NPY-Y5 NPY5-R NPY5R_HUMAN NPYY5 Neuropeptide Y receptor type 5 ( NPY Y5) | Y5 receptor
Type:
Enzyme
Mol. Mass.:
50746.64
Organism:
Homo sapiens (Human)
Description:
Q15761
Residue:
445
  
Inhibitor
Name:
BDBM50304300
Synonyms:
CHEMBL595573 | trans-N-[1-(2-fluorophenyl)-3-pyrazolyl]-3-oxospiro[6-azaisobenzofuran-1(3H),1'-cyclohexane]-4'-carboxamide
Type:
Small organic molecule
Emp. Form.:
C22H19FN4O3
Mol. Mass.:
406.4097
SMILES:
Fc1ccccc1-n1ccc(NC(=O)[C@H]2CC[C@@]3(CC2)OC(=O)c2ccncc32)n1
: