Target
Potassium voltage-gated channel subfamily H member 2
Ligand
BDBM50417403
Substrate
Meas. Tech.
ChEMBL_686321 (CHEMBL1293077)
IC50
1584.89±n/a nM
Citation
 Pizzi, DALeslie, CPMazzali, ASeri, CBiagetti, MBentley, JGenski, TDi Fabio, RContini, SSabbatini, FMZonzini, LCaberlotto, L Design, synthesis and SAR of a novel series of benzimidazoles as potent NPY Y5 antagonists. Bioorg Med Chem Lett 20:7120-3 (2010)  
Target
Name:
Potassium voltage-gated channel subfamily H member 2
Synonyms:
1,3-beta-glucan synthase component GLS2 ERG Eag-related protein 1 Ether-a-go-go-related gene (HERG) Ether-a-go-go-related gene potassium channel 1 Ether-a-go-go-related gene potassium channel 1 (hERG1) Ether-a-go-go-related protein 1 H-ERG KCNH2 Potassium voltage-gated channel subfamily H member 2 (hERG) Voltage-gated potassium channel subunit Kv11.1 hERG Potassium Channel 1 | putative potassium channel subunit
Type:
Multi-pass membrane protein
Mol. Mass.:
126672.65
Organism:
Homo sapiens (Human)
Description:
Q12809
Residue:
1159
  
Inhibitor
Name:
BDBM50417403
Synonyms:
CHEMBL1290038
Type:
Small organic molecule
Emp. Form.:
C22H19FN4O2
Mol. Mass.:
390.4103
SMILES:
Fc1ccc(cc1)N1C[C@@]2(CC[C@@H](CC2)c2nc3ccc(cc3[nH]2)C#N)OC1=O
: