Target
Alpha-1A adrenergic receptor
Ligand
BDBM50417403
Substrate
Meas. Tech.
ChEMBL_686320 (CHEMBL1293076)
Ki
>2511.89±n/a nM
Citation
 Pizzi, DALeslie, CPMazzali, ASeri, CBiagetti, MBentley, JGenski, TDi Fabio, RContini, SSabbatini, FMZonzini, LCaberlotto, L Design, synthesis and SAR of a novel series of benzimidazoles as potent NPY Y5 antagonists. Bioorg Med Chem Lett 20:7120-3 (2010)  
Target
Name:
Alpha-1A adrenergic receptor
Synonyms:
ADA1A_HUMAN ADRA1C Alpha 1A-adrenoceptor Alpha adrenergic receptor 1a Alpha-adrenergic receptor 1c adrenergic Alpha1 | adrenergic Alpha1C
Type:
Cell-surface receptors
Mol. Mass.:
51511.67
Organism:
Homo sapiens (Human)
Description:
P35348
Residue:
466
  
Inhibitor
Name:
BDBM50417403
Synonyms:
CHEMBL1290038
Type:
Small organic molecule
Emp. Form.:
C22H19FN4O2
Mol. Mass.:
390.4103
SMILES:
Fc1ccc(cc1)N1C[C@@]2(CC[C@@H](CC2)c2nc3ccc(cc3[nH]2)C#N)OC1=O
: