Target
Glutamate receptor 2
Ligand
BDBM50417567
Substrate
Meas. Tech.
ChEMBL_699692 (CHEMBL1648335)
EC50
1995.26±n/a nM
Citation
 Jamieson, CMaclean, JKBrown, CICampbell, RAGillen, KJGillespie, JKazemier, BKiczun, MLamont, YLyons, AJMoir, EMMorrow, JAPantling, JRankovic, ZSmith, L Structure based evolution of a novel series of positive modulators of the AMPA receptor. Bioorg Med Chem Lett 21:805-11 (2011)  
Target
Name:
Glutamate receptor 2
Synonyms:
AMPA-selective glutamate receptor 2 GRIA2 GluR-2 GluR-K2 Glutamate receptor 2 Glutamate receptor AMPA 2/3 Glutamate receptor ionotropic, AMPA 2
Type:
Enzyme Catalytic Domain
Mol. Mass.:
98825.96
Organism:
Homo sapiens (Human)
Description:
Glutamate AMPA 2 GRIA2 HUMAN::P42262
Residue:
883
  
Inhibitor
Name:
BDBM50417567
Synonyms:
CHEMBL1642171
Type:
Small organic molecule
Emp. Form.:
C22H22F3N3O4S
Mol. Mass.:
481.488
SMILES:
COc1ccccc1S(=O)(=O)NC1CCc2cc(Cn3cc(CO)c(n3)C(F)(F)F)ccc12
: