Target
Glutamate receptor 2
Ligand
BDBM50417574
Substrate
Meas. Tech.
ChEMBL_699692 (CHEMBL1648335)
EC50
100±n/a nM
Citation
 Jamieson, CMaclean, JKBrown, CICampbell, RAGillen, KJGillespie, JKazemier, BKiczun, MLamont, YLyons, AJMoir, EMMorrow, JAPantling, JRankovic, ZSmith, L Structure based evolution of a novel series of positive modulators of the AMPA receptor. Bioorg Med Chem Lett 21:805-11 (2011)  
Target
Name:
Glutamate receptor 2
Synonyms:
AMPA-selective glutamate receptor 2 GRIA2 GluR-2 GluR-K2 Glutamate receptor 2 Glutamate receptor AMPA 2/3 Glutamate receptor ionotropic, AMPA 2
Type:
Enzyme Catalytic Domain
Mol. Mass.:
98825.96
Organism:
Homo sapiens (Human)
Description:
Glutamate AMPA 2 GRIA2 HUMAN::P42262
Residue:
883
  
Inhibitor
Name:
BDBM50417574
Synonyms:
CHEMBL1642155
Type:
Small organic molecule
Emp. Form.:
C18H19F6N3O2S
Mol. Mass.:
455.418
SMILES:
CC(C)S(=O)(=O)N[C@H]1Cc2ccc(Cn3nc(cc3C(F)(F)F)C(F)(F)F)cc2C1
: