Target
Glutamate receptor 2
Ligand
BDBM50417578
Substrate
Meas. Tech.
ChEMBL_699692 (CHEMBL1648335)
EC50
1258.93±n/a nM
Citation
 Jamieson, CMaclean, JKBrown, CICampbell, RAGillen, KJGillespie, JKazemier, BKiczun, MLamont, YLyons, AJMoir, EMMorrow, JAPantling, JRankovic, ZSmith, L Structure based evolution of a novel series of positive modulators of the AMPA receptor. Bioorg Med Chem Lett 21:805-11 (2011)  
Target
Name:
Glutamate receptor 2
Synonyms:
AMPA-selective glutamate receptor 2 GRIA2 GluR-2 GluR-K2 Glutamate receptor 2 Glutamate receptor AMPA 2/3 Glutamate receptor ionotropic, AMPA 2
Type:
Enzyme Catalytic Domain
Mol. Mass.:
98825.96
Organism:
Homo sapiens (Human)
Description:
Glutamate AMPA 2 GRIA2 HUMAN::P42262
Residue:
883
  
Inhibitor
Name:
BDBM50417578
Synonyms:
CHEMBL1642159
Type:
Small organic molecule
Emp. Form.:
C19H24F3N3O2S
Mol. Mass.:
415.473
SMILES:
CCn1nc(cc1Cc1ccc2C[C@@H](Cc2c1)NS(=O)(=O)C(C)C)C(F)(F)F
: