Target
Rho-associated protein kinase 1
Ligand
BDBM50417668
Substrate
Meas. Tech.
ChEMBL_716633 (CHEMBL1670412)
Ki
37.15±n/a nM
Citation
 Ray, PWright, JAdam, JBoucharens, SBlack, DBrown, AREpemolu, OFletcher, DHuggett, MJones, PLaats, SLyons, Ade Man, JMorphy, RSherborne, BSherry, LStraten, NvWestwood, PYork, M Optimisation of 6-substituted isoquinolin-1-amine based ROCK-I inhibitors. Bioorg Med Chem Lett 21:1084-8 (2011)  
Target
Name:
Rho-associated protein kinase 1
Synonyms:
ROCK-I ROCK1_HUMAN Rho-associated protein kinase Rho-associated, coiled-coil-containing protein kinase 1 Rho-kinase (ROCK I) p160 ROCK-1 | p160ROCK
Type:
Serine/threonine-protein kinase
Mol. Mass.:
158156.77
Organism:
Homo sapiens (Human)
Description:
Q13464
Residue:
1354
  
Inhibitor
Name:
BDBM50417668
Synonyms:
CHEMBL1643368
Type:
Small organic molecule
Emp. Form.:
C14H17N3O
Mol. Mass.:
243.3043
SMILES:
Nc1nccc2cc(O[C@H]3CCCNC3)ccc12
: