Target
Glucocorticoid receptor
Ligand
BDBM50417887
Substrate
Meas. Tech.
ChEMBL_716758 (CHEMBL1670640)
IC50
0.501±n/a nM
Citation
 Diallo, HAngell, DCBarnett, HABiggadike, KCoe, DMCooper, TWCraven, AGray, JRHouse, DJack, TIKeeling, SPMacdonald, SJMcLay, IMOliver, STaylor, SJUings, IJWellaway, N Discovery of a potent series of non-steroidal nona-trifluoromethyl carbinol glucocorticoid receptor agonists with reduced lipophilicity. Bioorg Med Chem Lett 21:1126-33 (2011)  
Target
Name:
Glucocorticoid receptor
Synonyms:
GCR_HUMAN GRL Glucocorticoid receptor (GRFP) Nuclear receptor subfamily 3 group C member 1
Type:
Enzyme
Mol. Mass.:
85656.87
Organism:
Homo sapiens (Human)
Description:
P04150
Residue:
777
  
Inhibitor
Name:
BDBM50417887
Synonyms:
CHEMBL1668077
Type:
Small organic molecule
Emp. Form.:
C29H37N5O2S
Mol. Mass.:
519.701
SMILES:
CC(C)Nc1cccc(c1)-n1ncc2c(NC[C@H](C)NS(=O)(=O)c3c(C)cc(C)cc3C)cc(C)cc12
: