Target
Glucocorticoid receptor
Ligand
BDBM50417891
Substrate
Meas. Tech.
ChEMBL_716756 (CHEMBL1670638)
IC50
0.501±n/a nM
Citation
 Diallo, HAngell, DCBarnett, HABiggadike, KCoe, DMCooper, TWCraven, AGray, JRHouse, DJack, TIKeeling, SPMacdonald, SJMcLay, IMOliver, STaylor, SJUings, IJWellaway, N Discovery of a potent series of non-steroidal nona-trifluoromethyl carbinol glucocorticoid receptor agonists with reduced lipophilicity. Bioorg Med Chem Lett 21:1126-33 (2011)  
Target
Name:
Glucocorticoid receptor
Synonyms:
GCR_HUMAN GRL Glucocorticoid receptor (GRFP) Nuclear receptor subfamily 3 group C member 1
Type:
Enzyme
Mol. Mass.:
85656.87
Organism:
Homo sapiens (Human)
Description:
P04150
Residue:
777
  
Inhibitor
Name:
BDBM50417891
Synonyms:
CHEMBL1668081
Type:
Small organic molecule
Emp. Form.:
C29H36N6O3S
Mol. Mass.:
548.7
SMILES:
C[C@@H](CNc1cc(C)cc2n(ncc12)-c1cccc(N[C@@H](C)C(N)=O)c1)NS(=O)(=O)c1c(C)cc(C)cc1C
: