Target
Glucocorticoid receptor
Ligand
BDBM50417888
Substrate
Meas. Tech.
ChEMBL_716758 (CHEMBL1670640)
IC50
1.26±n/a nM
Citation
 Diallo, HAngell, DCBarnett, HABiggadike, KCoe, DMCooper, TWCraven, AGray, JRHouse, DJack, TIKeeling, SPMacdonald, SJMcLay, IMOliver, STaylor, SJUings, IJWellaway, N Discovery of a potent series of non-steroidal nona-trifluoromethyl carbinol glucocorticoid receptor agonists with reduced lipophilicity. Bioorg Med Chem Lett 21:1126-33 (2011)  
Target
Name:
Glucocorticoid receptor
Synonyms:
GCR_HUMAN GRL Glucocorticoid receptor (GRFP) Nuclear receptor subfamily 3 group C member 1
Type:
Enzyme
Mol. Mass.:
85656.87
Organism:
Homo sapiens (Human)
Description:
P04150
Residue:
777
  
Inhibitor
Name:
BDBM50417888
Synonyms:
CHEMBL1668078
Type:
Small organic molecule
Emp. Form.:
C29H35N5O2S
Mol. Mass.:
517.686
SMILES:
C[C@@H](CNc1cc(C)cc2n(ncc12)-c1cccc(NC2CC2)c1)NS(=O)(=O)c1c(C)cc(C)cc1C
: