Target
Cytochrome P450 3A4
Ligand
BDBM50418093
Substrate
Meas. Tech.
ChEMBL_738368 (CHEMBL1743445)
Ki
310±n/a nM
Citation
 Fontana, EDansette, PMPoli, SM Cytochrome p450 enzymes mechanism based inhibitors: common sub-structures and reactivity. Curr Drug Metab 6:413-54 (2005)  
Target
Name:
Cytochrome P450 3A4
Synonyms:
Albendazole monooxygenase CP3A4_HUMAN CYP3A4 CYPIIIA4 Cytochrome P450 3A4 (CYP3A4) Nifedipine oxidase Taurochenodeoxycholate 6-alpha-hydroxylase
Type:
Enzyme
Mol. Mass.:
57349.57
Organism:
Homo sapiens (Human)
Description:
Residue:
503
  
Inhibitor
Name:
BDBM50418093
Synonyms:
CHEMBL1743356
Type:
Small organic molecule
Emp. Form.:
C42H44O10
Mol. Mass.:
708.7928
SMILES:
C\C(CCC(OC(C)(C)C(O)CC\C(C)=C\COc1c2ccoc2cc2oc(=O)ccc12)C(C)=C)=C/COc1c2ccoc2cc2oc(=O)ccc12
: