Target
Beta-2 adrenergic receptor
Ligand
BDBM50419310
Substrate
Meas. Tech.
ChEMBL_773263 (CHEMBL1840215)
EC50
0.251189±n/a nM
Citation
 Procopiou, PABarrett, VJFord, AJLooker, BELunniss, GENeedham, DSmith, CESomers, G The discovery of long-acting saligeninß2 adrenergic receptor agonists incorporating a urea group. Bioorg Med Chem 19:6026-32 (2011)  
Target
Name:
Beta-2 adrenergic receptor
Synonyms:
ADRB2 ADRB2_HUMAN Beta-2 adrenoceptor | Beta-2 adrenoreceptor
Type:
Mol. Mass.:
46461.69
Organism:
Homo sapiens (Human)
Description:
P07550
Residue:
413
  
Inhibitor
Name:
BDBM50419310
Synonyms:
CHEMBL1835859
Type:
Small organic molecule
Emp. Form.:
C28H42N4O6
Mol. Mass.:
530.6563
SMILES:
NC(=O)CNC(=O)Nc1cccc(CCCCOCCCCCCNC[C@H](O)c2ccc(O)c(CO)c2)c1
: