Target
Neuronal acetylcholine receptor subunit alpha-4/beta-2
Ligand
BDBM50419819
Substrate
Meas. Tech.
ChEMBL_804324 (CHEMBL1954620)
IC50
11220.18±n/a nM
Citation
 Henderson, BJOrac, CMMaciagiewicz, IBergmeier, SCMcKay, DB 3D-QSAR and 3D-QSSR models of negative allosteric modulators facilitate the design of a novel selective antagonist of humana4ß2 neuronal nicotinic acetylcholine receptors. Bioorg Med Chem Lett 22:1797-813 (2012)  
Target
Name:
Neuronal acetylcholine receptor subunit alpha-4/beta-2
Synonyms:
Neuronal acetylcholine receptor Alpha-4/Beta-2 Neuronal acetylcholine receptor; alpha4/beta2 | nAChR subtypes alpha4 beta2
Type:
Protein
Mol. Mass.:
Description:
Components:
This complex has 2 components.
Component 1
Name:
Neuronal acetylcholine receptor subunit alpha-4
Synonyms:
ACHA4_HUMAN CHRNA4 protein Neuronal acetylcholine receptor protein alpha-4 subunit Nicotinic acetylcholine receptor alpha4/beta2/alpha5
Type:
Mol. Mass.:
69963.49
Organism:
Homo sapiens (Human)
Description:
NACHRA4
Residue:
627
  
Component 2
Name:
Neuronal acetylcholine receptor subunit beta-2
Synonyms:
ACHB2_HUMAN Neuronal acetylcholine receptor protein beta-2 subunit | Nicotinic acetylcholine receptor alpha3/beta2/alpha5
Type:
Protein
Mol. Mass.:
57020.50
Organism:
Homo sapiens (Human)
Description:
P17787
Residue:
502
  
Inhibitor
Name:
BDBM50419819
Synonyms:
CHEMBL1950604
Type:
Small organic molecule
Emp. Form.:
C27H32N2O5
Mol. Mass.:
464.5534
SMILES:
Cc1cc(O)n(c1O)-c1ccccc1C(=O)OCC1CCCN(CCOc2ccc(C)cc2)C1
: