Target
Beta-secretase 1
Ligand
BDBM50419872
Substrate
Meas. Tech.
ChEMBL_807684 (CHEMBL1959449)
IC50
22±n/a nM
Citation
 Swahn, BMHolenz, JKihlström, JKolmodin, KLindström, JPlobeck, NRotticci, DSehgelmeble, FSundström, MBerg, SvFälting, JGeorgievska, BGustavsson, SNeelissen, JEk, MOlsson, LLBerg, S Aminoimidazoles as BACE-1 inhibitors: the challenge to achieve in vivo brain efficacy. Bioorg Med Chem Lett 22:1854-9 (2012)  
Target
Name:
Beta-secretase 1
Synonyms:
ASP2 Aspartyl protease 2 BACE1 Beta-secretase (BACE) Beta-secretase 1 (BACE 1) Beta-secretase 1 (BACE1) Beta-site amyloid precursor protein cleaving enzyme 1 Memapsin-2 beta-Secretase (BACE-1) | beta-Secretase (BACE1)
Type:
Protein
Mol. Mass.:
55755.10
Organism:
Homo sapiens (Human)
Description:
P56817
Residue:
501
  
Inhibitor
Name:
BDBM50419872
Synonyms:
CHEMBL1957469
Type:
Small organic molecule
Emp. Form.:
C25H22Cl2N4O
Mol. Mass.:
465.374
SMILES:
COc1ccc(cc1)C1(N=C(N)N2CCCN=C12)c1cccc(c1)-c1cc(Cl)cc(Cl)c1
: