Target
Beta-secretase 1
Ligand
BDBM50419859
Substrate
Meas. Tech.
ChEMBL_807805 (CHEMBL1959583)
IC50
15±n/a nM
Citation
 Swahn, BMHolenz, JKihlström, JKolmodin, KLindström, JPlobeck, NRotticci, DSehgelmeble, FSundström, MBerg, SvFälting, JGeorgievska, BGustavsson, SNeelissen, JEk, MOlsson, LLBerg, S Aminoimidazoles as BACE-1 inhibitors: the challenge to achieve in vivo brain efficacy. Bioorg Med Chem Lett 22:1854-9 (2012)  
Target
Name:
Beta-secretase 1
Synonyms:
ASP2 Aspartyl protease 2 BACE1 Beta-secretase (BACE) Beta-secretase 1 (BACE 1) Beta-secretase 1 (BACE1) Beta-site amyloid precursor protein cleaving enzyme 1 Memapsin-2 beta-Secretase (BACE-1) | beta-Secretase (BACE1)
Type:
Protein
Mol. Mass.:
55755.10
Organism:
Homo sapiens (Human)
Description:
P56817
Residue:
501
  
Inhibitor
Name:
BDBM50419859
Synonyms:
CHEMBL1957482
Type:
Small organic molecule
Emp. Form.:
C22H21F5N4O2
Mol. Mass.:
468.4198
SMILES:
NC1=NC(C2=NCC(F)(F)CN12)(c1ccc(OC(F)F)cc1)c1cccc(OCCCF)c1
: