Target
Solute carrier family 22 member 2
Ligand
BDBM50403559
Substrate
Meas. Tech.
ChEMBL_838729 (CHEMBL2078555)
Ki
9400±n/a nM
Citation
 Urakami, YOkuda, MMasuda, SSaito, HInui, KI Functional characteristics and membrane localization of rat multispecific organic cation transporters, OCT1 and OCT2, mediating tubular secretion of cationic drugs. J Pharmacol Exp Ther 287:800-5 (1998) Target
Name:
Solute carrier family 22 member 2
Synonyms:
Adrenaline alpha2 Organic cation transporter 2 Slc22a2 rOCT2
Type:
Enzyme Catalytic Domain
Mol. Mass.:
62348.38
Organism:
RAT
Description:
Adrenaline alpha2 0 RAT::Q9R0W2
Residue:
555
  
Inhibitor
Name:
BDBM50403559
Synonyms:
Brumetadina | CIMETIDINE
Type:
Small organic molecule
Emp. Form.:
C10H16N6S
Mol. Mass.:
252.339
SMILES:
CNC(NCCSCc1[nH]cnc1C)=NC#N
: