Target
Solute carrier organic anion transporter family member 1A4
Ligand
BDBM50206509
Substrate
Meas. Tech.
ChEMBL_836631 (CHEMBL2077473)
Ki
72900±n/a nM
Citation
 Sugiyama, DKusuhara, HShitara, YAbe, TMeier, PJSekine, TEndou, HSuzuki, HSugiyama, Y Characterization of the efflux transport of 17beta-estradiol-D-17beta-glucuronide from the brain across the blood-brain barrier. J Pharmacol Exp Ther 298:316-22 (2001) Target
Name:
Solute carrier organic anion transporter family member 1A4
Synonyms:
Brain digoxin carrier protein OATP-B1 Oatp2 Slc21a5 Sodium-independent organic anion-transporting polypeptide 2 | Solute carrier family 21 member 5
Type:
PROTEIN
Mol. Mass.:
73261.82
Organism:
Rattus norvegicus
Description:
ChEMBL_836631
Residue:
661
  
Inhibitor
Name:
BDBM50206509
Synonyms:
4-Dipropylsulfamoyl-benzoic acid 4-Dipropylsulfamoyl-benzoic acid(probenecid) CHEMBL897 Probalan
Type:
Small organic molecule
Emp. Form.:
C13H19NO4S
Mol. Mass.:
285.359
SMILES:
CCCN(CCC)S(=O)(=O)c1ccc(cc1)C(O)=O
: